Reaction Details
TargetMuscarinic acetylcholine receptor M2
LigandBDBM50416730
Substrate/Competitorn/a
Meas. Tech.ChEMBL_652864 (CHEMBL1226067)
EC50 630.96±n/a nM
Citation Johnson, DJForbes, ITWatson, SPGarzya, VStevenson, GIWalker, GRMudhar, HSFlynn, STWyman, PASmith, PWMurkitt, GSLucas, AJMookherjee, CRWatson, JMGartlon, JEBradford, AMBrown, F The discovery of a series of N-substituted 3-(4-piperidinyl)-1,3-benzoxazolinones and oxindoles as highly brain penetrant, selective muscarinic M1 agonists. Bioorg Med Chem Lett20:5434-8 (2010) 
 
Muscarinic acetylcholine receptor M2
Name:Muscarinic acetylcholine receptor M2
Type:GPCR
Mol. Mass.:51730.61
Organism:Homo sapiens (Human)
Description:P08172
Residue:466
BDBM50416730
NameBDBM50416730
Synonyms:CHEMBL1223940
TypeSmall organic molecule
Emp. Form.C23H34N2O4
Mol. Mass.402.5271
SMILESCOCCO[C@H]1CC[C@@](C)(CC1)N1CCC(CC1)n1c2cc(C)ccc2oc1=O