Reaction Details
TargetMuscarinic acetylcholine receptor M5
LigandBDBM50416730
Substrate/Competitorn/a
Meas. Tech.ChEMBL_652867 (CHEMBL1226070)
EC50 158.49±n/a nM
Citation Johnson, DJForbes, ITWatson, SPGarzya, VStevenson, GIWalker, GRMudhar, HSFlynn, STWyman, PASmith, PWMurkitt, GSLucas, AJMookherjee, CRWatson, JMGartlon, JEBradford, AMBrown, F The discovery of a series of N-substituted 3-(4-piperidinyl)-1,3-benzoxazolinones and oxindoles as highly brain penetrant, selective muscarinic M1 agonists. Bioorg Med Chem Lett20:5434-8 (2010) 
 
Muscarinic acetylcholine receptor M5
Name:Muscarinic acetylcholine receptor M5
Type:PROTEIN
Mol. Mass.:60102.35
Organism:Homo sapiens (Human)
Description:ChEMBL_1517990
Residue:532
BDBM50416730
NameBDBM50416730
Synonyms:CHEMBL1223940
TypeSmall organic molecule
Emp. Form.C23H34N2O4
Mol. Mass.402.5271
SMILESCOCCO[C@H]1CC[C@@](C)(CC1)N1CCC(CC1)n1c2cc(C)ccc2oc1=O