Reaction Details
TargetMuscarinic acetylcholine receptor M1
LigandBDBM50416739
Substrate/Competitorn/a
Meas. Tech.ChEMBL_652863 (CHEMBL1226066)
EC50 1.26±n/a nM
Citation Johnson, DJForbes, ITWatson, SPGarzya, VStevenson, GIWalker, GRMudhar, HSFlynn, STWyman, PASmith, PWMurkitt, GSLucas, AJMookherjee, CRWatson, JMGartlon, JEBradford, AMBrown, F The discovery of a series of N-substituted 3-(4-piperidinyl)-1,3-benzoxazolinones and oxindoles as highly brain penetrant, selective muscarinic M1 agonists. Bioorg Med Chem Lett20:5434-8 (2010) 
 
Muscarinic acetylcholine receptor M1
Name:Muscarinic acetylcholine receptor M1
Type:Protein
Mol. Mass.:51442.54
Organism:Homo sapiens (Human)
Description:P11229
Residue:460
BDBM50416739
NameBDBM50416739
Synonyms:CHEMBL1223861
TypeSmall organic molecule
Emp. Form.C22H31FN2O3
Mol. Mass.390.4915
SMILESCCO[C@H]1CC[C@@](C)(CC1)N1CCC(CC1)n1c2cc(C)cc(F)c2oc1=O