Reaction Details
TargetVascular endothelial growth factor receptor 2
LigandBDBM50416746
Substrate/Competitorn/a
Meas. Tech.ChEMBL_655558 (CHEMBL1244602)
IC50 0.2±n/a nM
Citation Du, JLei, BQin, JLiu, HYao, X Molecular modeling studies of vascular endothelial growth factor receptor tyrosine kinase inhibitors using QSAR and docking. J Mol Graph Model27:642-54 (2008) 
 
Vascular endothelial growth factor receptor 2
Name:Vascular endothelial growth factor receptor 2
Type:Receptor Tyrosine Kinase
Mol. Mass.:151510.97
Organism:Homo sapiens (Human)
Description:P35968
Residue:1356
BDBM50416746
NameBDBM50416746
Synonyms:CHEMBL1242387
TypeSmall organic molecule
Emp. Form.C29H21ClN2O4
Mol. Mass.496.941
SMILESCOc1cc2nccc(Oc3ccc4c(cccc4c3)C(=O)Nc3ccc(Cl)cc3)c2cc1C(C)=O