Reaction Details
TargetVascular endothelial growth factor receptor 2
LigandBDBM50376003
Substrate/Competitorn/a
Meas. Tech.ChEMBL_655558 (CHEMBL1244602)
IC50 0.891±n/a nM
Citation Du, JLei, BQin, JLiu, HYao, X Molecular modeling studies of vascular endothelial growth factor receptor tyrosine kinase inhibitors using QSAR and docking. J Mol Graph Model27:642-54 (2008) 
 
Vascular endothelial growth factor receptor 2
Name:Vascular endothelial growth factor receptor 2
Type:Receptor Tyrosine Kinase
Mol. Mass.:151510.97
Organism:Homo sapiens (Human)
Description:P35968
Residue:1356
BDBM50376003
NameBDBM50376003
Synonyms:CHEMBL271984
TypeSmall organic molecule
Emp. Form.C22H18N2O4
Mol. Mass.374.3893
SMILESCOc1cc2nccc(Oc3ccc4c(cccc4c3)C(N)=O)c2cc1OC