Reaction Details
TargetVascular endothelial growth factor receptor 2
LigandBDBM50375681
Substrate/Competitorn/a
Meas. Tech.ChEMBL_655558 (CHEMBL1244602)
IC50 0.2±n/a nM
Citation Du, JLei, BQin, JLiu, HYao, X Molecular modeling studies of vascular endothelial growth factor receptor tyrosine kinase inhibitors using QSAR and docking. J Mol Graph Model27:642-54 (2008) 
 
Vascular endothelial growth factor receptor 2
Name:Vascular endothelial growth factor receptor 2
Type:Receptor Tyrosine Kinase
Mol. Mass.:151510.97
Organism:Homo sapiens (Human)
Description:P35968
Residue:1356
BDBM50375681
NameBDBM50375681
Synonyms:CHEMBL411630
TypeSmall organic molecule
Emp. Form.C27H25N3O5
Mol. Mass.471.5045
SMILESCOc1cc2nccc(Oc3ccc4N(CCOc4c3)C(=O)Nc3ccc(C)cc3)c2cc1OC