Reaction Details
TargetAlpha-1A adrenergic receptor
LigandBDBM50416779
Substrate/Competitorn/a
Meas. Tech.ChEMBL_658237 (CHEMBL1246629)
Ki 0.871±n/a nM
Citation Franchini, SPrandi, ABaraldi, ASorbi, CTait, ABuccioni, MMarucci, GCilia, APirona, LFossa, PCichero, EBrasili, L 1,3-Dioxolane-based ligands incorporating a lactam or imide moiety: structure-affinity/activity relationship at alpha1-adrenoceptor subtypes and at 5-HT1A receptors. Eur J Med Chem45:3740-51 (2010) 
 
Alpha-1A adrenergic receptor
Name:Alpha-1A adrenergic receptor
Type:Cell-surface receptors
Mol. Mass.:51511.67
Organism:Homo sapiens (Human)
Description:P35348
Residue:466
BDBM50416779
NameBDBM50416779
Synonyms:CHEMBL1242541
TypeSmall organic molecule
Emp. Form.C27H35N3O4
Mol. Mass.465.5845
SMILESCOc1ccccc1N1CCN(C[C@H]2CO[C@](CN3CCCCC3=O)(O2)c2ccccc2)CC1