Reaction Details
TargetAlpha-1A adrenergic receptor
LigandBDBM50416853
Substrate/Competitorn/a
Meas. Tech.ChEMBL_663467 (CHEMBL1251066)
Ki 0.468±n/a nM
Citation Carrieri, APiergentili, ADel Bello, FGiannella, MPigini, MLeonardi, AFanelli, FQuaglia, W Structure-activity relationships in 1,4-benzodioxan-related compounds. 10. Novela1-adrenoreceptor antagonists related to openphendioxan: synthesis, biological evaluation, anda1d computational study. Bioorg Med Chem18:7065-77 (2010) 
 
Alpha-1A adrenergic receptor
Name:Alpha-1A adrenergic receptor
Type:Cell-surface receptors
Mol. Mass.:51511.67
Organism:Homo sapiens (Human)
Description:P35348
Residue:466
BDBM50416853
NameBDBM50416853
Synonyms:CHEMBL43116
TypeSmall organic molecule
Emp. Form.C25H29NO5
Mol. Mass.423.5015
SMILESCOc1cccc(OC)c1OCCNCCOc1ccccc1OCc1ccccc1