Reaction Details
TargetAlpha-1D adrenergic receptor
LigandBDBM50416853
Substrate/Competitorn/a
Meas. Tech.ChEMBL_663469 (CHEMBL1251068)
Ki 0.0676±n/a nM
Citation Carrieri, APiergentili, ADel Bello, FGiannella, MPigini, MLeonardi, AFanelli, FQuaglia, W Structure-activity relationships in 1,4-benzodioxan-related compounds. 10. Novela1-adrenoreceptor antagonists related to openphendioxan: synthesis, biological evaluation, anda1d computational study. Bioorg Med Chem18:7065-77 (2010) 
 
Alpha-1D adrenergic receptor
Name:Alpha-1D adrenergic receptor
Type:Enzyme Catalytic Domain
Mol. Mass.:60485.82
Organism:Homo sapiens (Human)
Description:adrenergic Alpha1D ADRA1D HUMAN::P25100
Residue:572
BDBM50416853
NameBDBM50416853
Synonyms:CHEMBL43116
TypeSmall organic molecule
Emp. Form.C25H29NO5
Mol. Mass.423.5015
SMILESCOc1cccc(OC)c1OCCNCCOc1ccccc1OCc1ccccc1