Reaction Details
TargetMineralocorticoid receptor
LigandBDBM50172022
Substrate/Competitorn/a
Meas. Tech.ChEMBL_664241 (CHEMBL1261748)
IC50 1.26±n/a nM
Citation Jaroch, SBerger, MHuwe, CKrolikiewicz, KRehwinkel, HSchäcke, HSchmees, NSkuballa, W Discovery of quinolines as selective glucocorticoid receptor agonists. Bioorg Med Chem Lett20:5835-8 (2010) 
 
Mineralocorticoid receptor
Name:Mineralocorticoid receptor
Type:Enzyme
Mol. Mass.:107076.42
Organism:Homo sapiens (Human)
Description:P08235
Residue:984
BDBM50172022
NameBDBM50172022
Synonyms:4-(5-Fluoro-2-hydroxy-phenyl)-2-hydroxy-4-methyl-2-trifluoromethyl-pentanoic acid (4-methyl-1-oxo-1H-benzo[d][1,2]oxazin-6-yl)-amide | CHEMBL196374
TypeSmall organic molecule
Emp. Form.C22H20F4N2O5
Mol. Mass.468.3982
SMILESCc1noc(=O)c2ccc(NC(=O)C(O)(CC(C)(C)c3cc(F)ccc3O)C(F)(F)F)cc12