Reaction Details
TargetProgesterone receptor
LigandBDBM50201099
Substrate/Competitorn/a
Meas. Tech.ChEMBL_664240 (CHEMBL1261747)
IC50 19.95±n/a nM
Citation Jaroch, SBerger, MHuwe, CKrolikiewicz, KRehwinkel, HSchäcke, HSchmees, NSkuballa, W Discovery of quinolines as selective glucocorticoid receptor agonists. Bioorg Med Chem Lett20:5835-8 (2010) 
 
Progesterone receptor
Name:Progesterone receptor
Type:Protein
Mol. Mass.:98979.52
Organism:Homo sapiens (Human)
Description:P06401
Residue:933
BDBM50201099
NameBDBM50201099
Synonyms:4-(2,3-dihydrobenzofuran-7-yl)-2-hydroxy-4-methyl-N-(4-methyl-1-oxo-1H-benzo[d][1,2]oxazin-6-yl)-2-(trifluoromethyl)pentanamide ZK-216348
TypeSmall organic molecule
Emp. Form.C24H23F3N2O5
Mol. Mass.476.445
SMILESCc1noc(=O)c2ccc(NC(=O)C(O)(CC(C)(C)c3cccc4CCOc34)C(F)(F)F)cc12