Reaction Details
Target5-hydroxytryptamine receptor 3A
LigandBDBM50000483
Substrate/Competitorn/a
Meas. Tech.ChEMBL_685540 (CHEMBL1285707)
Ki 3.98±n/a nM
Citation Moura Barbosa, AJDe Rienzo, FRamos, MJMenziani, MC Computational analysis of ligand recognition sites of homo- and heteropentameric 5-HT3 receptors. Eur J Med Chem45:4746-60 (2010) 
 
5-hydroxytryptamine receptor 3A
Name:5-hydroxytryptamine receptor 3A
Type:Protein
Mol. Mass.:55283.27
Organism:Homo sapiens (Human)
Description:P46098
Residue:478
BDBM50000483
NameBDBM50000483
Synonyms:(BRL 43694)1-Methyl-1H-indazole-3-carboxylic acid (9-methyl-9-aza-bicyclo[3.3.1]non-3-yl)-amide 1-Methyl-1H-indazole-3-carboxylic acid (8-methyl-8-aza-bicyclo[3.2.1]oct-3-yl)-amide 1-Methyl-1H-indazole-3-carboxylic acid (9-methyl-9-aza-bicyclo[3.3.1]non-3-yl)-amide(BRL 43694) 1-methyl-N-((1S,5R)-9-methyl-9-aza-bicyclo[3.3.1]nonan-3-yl)-1H-indazole-3-carboxamide BRL 43694 CHEMBL519643 LY-278584
TypeSmall organic molecule
Emp. Form.C18H24N4O
Mol. Mass.312.4094
SMILESCN1C2CCCC1CC(C2)NC(=O)c1nn(C)c2ccccc12