Reaction Details
TargetAlpha-2B adrenergic receptor
LigandBDBM50417346
Substrate/Competitorn/a
Meas. Tech.ChEMBL_684818 (CHEMBL1286048)
EC50 3162±n/a nM
Citation Del Bello, FMattioli, LGhelfi, FGiannella, MPiergentili, AQuaglia, WCardinaletti, CPerfumi, MThomas, RJZanelli, UMarchioro, CDal Cin, MPigini, M Fruitful adrenergica(2C)-agonism/a(2A)-antagonism combination to prevent and contrast morphine tolerance and dependence. J Med Chem53:7825-35 (2010) 
 
Alpha-2B adrenergic receptor
Name:Alpha-2B adrenergic receptor
Type:Enzyme
Mol. Mass.:49964.20
Organism:Homo sapiens (Human)
Description:P18089
Residue:450
BDBM50417346
NameBDBM50417346
Synonyms:CHEMBL1276220
TypeSmall organic molecule
Emp. Form.C14H18N2O
Mol. Mass.230.3055
SMILESC[C@H](Oc1ccccc1C1CC1)C1=NCCN1