Reaction Details
TargetAlpha-2A adrenergic receptor
LigandBDBM50016897
Substrate/Competitorn/a
Meas. Tech.ChEMBL_684814 (CHEMBL1285951)
EC50 8.3±n/a nM
Citation Del Bello, FMattioli, LGhelfi, FGiannella, MPiergentili, AQuaglia, WCardinaletti, CPerfumi, MThomas, RJZanelli, UMarchioro, CDal Cin, MPigini, M Fruitful adrenergica(2C)-agonism/a(2A)-antagonism combination to prevent and contrast morphine tolerance and dependence. J Med Chem53:7825-35 (2010) 
 
Alpha-2A adrenergic receptor
Name:Alpha-2A adrenergic receptor
Type:Enzyme
Mol. Mass.:48979.91
Organism:Homo sapiens (Human)
Description:P08913
Residue:465
BDBM50016897
NameBDBM50016897
Synonyms:2-(2,6-dichloroanilino)-1,3-diazacyclopentene-(2) CLONIDINE clonidine (amino form)
TypeSmall organic molecule
Emp. Form.C9H9Cl2N3
Mol. Mass.230.094
SMILESClc1cccc(Cl)c1\[#7]=[#6]-1\[#7]-[#6]-[#6]-[#7]-1