Reaction Details
TargetBcl-2-like protein 1
LigandBDBM21429
Substrate/Competitorn/a
Meas. Tech.ChEMBL_687845 (CHEMBL1291409)
EC50 1100±n/a nM
Citation Almerico, AMTutone, MLauria, A 3D-QSAR pharmacophore modeling and in silico screening of new Bcl-xl inhibitors. Eur J Med Chem45:4774-82 (2010) 
 
Bcl-2-like protein 1
Name:Bcl-2-like protein 1
Type:Mitochondrion membrane; Single-pass membrane protein
Mol. Mass.:26039.60
Organism:Homo sapiens (Human)
Description:n/a
Residue:233
BDBM21429
NameBDBM21429
Synonyms:4-Piperidinebenzylidene derivative, 10h | 4-{4-[(2-cyanophenyl)methylidene]piperidin-1-yl}-N-[(4-{[(2R)-4-(dimethylamino)-1-(phenylsulfanyl)butan-2-yl]amino}-3-nitrobenzene)sulfonyl]benzamide
TypeSmall organic molecule
Emp. Form.C38H40N6O5S2
Mol. Mass.724.891
SMILES[#6]-[#7](-[#6])-[#6]-[#6]-[#6@H](-[#6]-[#16]-c1ccccc1)-[#7]-c1ccc(cc1-[#7+](-[#8-])=O)S(=O)(=O)[#7]-[#6](=O)-c1ccc(cc1)-[#7]-1-[#6]-[#6]\[#6](-[#6]-[#6]-1)=[#6]/c1ccccc1C#N