Reaction Details
TargetCorticotropin-releasing factor receptor 1
LigandBDBM50417505
Substrate/Competitorn/a
Meas. Tech.ChEMBL_685890 (CHEMBL1292646)
Ki 50.12±n/a nM
Citation Tellew, JELanier, MMoorjani, MLin, ELuo, ZSlee, DHZhang, XHoare, SRGrigoriadis, DESt Denis, YDi Fabio, RDi Modugno, ESaunders, JWilliams, JP Discovery of NBI-77860/GSK561679, a potent corticotropin-releasing factor (CRF1) receptor antagonist with improved pharmacokinetic properties. Bioorg Med Chem Lett20:7259-64 (2010) 
 
Corticotropin-releasing factor receptor 1
Name:Corticotropin-releasing factor receptor 1
Type:Enzyme
Mol. Mass.:50744.31
Organism:Homo sapiens (Human)
Description:P34998
Residue:444
BDBM50417505
NameBDBM50417505
Synonyms:CHEMBL1287965
TypeSmall organic molecule
Emp. Form.C23H26N6O2
Mol. Mass.418.4915
SMILESCOc1ccc(-c2c(C)nn3c(NC4(CCC4)c4nc(C)no4)cc(C)nc23)c(C)c1