Reaction Details
TargetCorticotropin-releasing factor receptor 1
LigandBDBM50417509
Substrate/Competitorn/a
Meas. Tech.ChEMBL_685890 (CHEMBL1292646)
Ki 79.43±n/a nM
Citation Tellew, JELanier, MMoorjani, MLin, ELuo, ZSlee, DHZhang, XHoare, SRGrigoriadis, DESt Denis, YDi Fabio, RDi Modugno, ESaunders, JWilliams, JP Discovery of NBI-77860/GSK561679, a potent corticotropin-releasing factor (CRF1) receptor antagonist with improved pharmacokinetic properties. Bioorg Med Chem Lett20:7259-64 (2010) 
 
Corticotropin-releasing factor receptor 1
Name:Corticotropin-releasing factor receptor 1
Type:Enzyme
Mol. Mass.:50744.31
Organism:Homo sapiens (Human)
Description:P34998
Residue:444
BDBM50417509
NameBDBM50417509
Synonyms:CHEMBL1288026
TypeSmall organic molecule
Emp. Form.C22H26N6O2
Mol. Mass.406.4808
SMILESCOc1ccc(-c2c(C)nn3c(NC(C)Cc4noc(C)n4)cc(C)nc23)c(C)c1