Reaction Details
TargetAlpha-1A adrenergic receptor
LigandBDBM50417539
Substrate/Competitorn/a
Meas. Tech.ChEMBL_693737 (CHEMBL1638256)
Ki 19.05±n/a nM
Citation Sagratini, GAngeli, PBuccioni, MGulini, UMarucci, GMelchiorre, CPoggesi, EGiardinà, D Synthesis anda1-adrenoceptor antagonist activity of tamsulosin analogues. Eur J Med Chem45:5800-7 (2010) 
 
Alpha-1A adrenergic receptor
Name:Alpha-1A adrenergic receptor
Type:Cell-surface receptors
Mol. Mass.:51511.67
Organism:Homo sapiens (Human)
Description:P35348
Residue:466
BDBM50417539
NameBDBM50417539
Synonyms:CHEMBL1630941
TypeSmall organic molecule
Emp. Form.C20H26N2O5S
Mol. Mass.406.496
SMILESCOc1ccc(C[C@@H](C)NC[C@H]2Oc3ccccc3O[C@H]2C)cc1S(N)(=O)=O