Reaction Details
TargetDelta-type opioid receptor
LigandBDBM50417579
Substrate/Competitorn/a
Meas. Tech.ChEMBL_699953 (CHEMBL1646360)
Ki 316±n/a nM
Citation Zhang, CWestaway, SMSpeake, JDBishop, MJGoetz, ASCarballo, LHHu, MEpperly, AH Tetrahydroquinoline derivatives as opioid receptor antagonists. Bioorg Med Chem Lett21:670-6 (2011) 
 
Delta-type opioid receptor
Name:Delta-type opioid receptor
Type:G Protein-Coupled Receptor (GPCR)
Mol. Mass.:40382.98
Organism:Homo sapiens (Human)
Description:Competition binding assays were carried out using membrane preparations from transfected HN9.10 cells that constitutively expressed the delta opioid receptor.
Residue:372
BDBM50417579
NameBDBM50417579
Synonyms:CHEMBL1642737
TypeSmall organic molecule
Emp. Form.C22H29N3O
Mol. Mass.351.4852
SMILESCC(C)CCNCc1ccc(cc1)N1CCCc2cc(ccc12)C(N)=O