Reaction Details
TargetDelta-type opioid receptor
LigandBDBM50417586
Substrate/Competitorn/a
Meas. Tech.ChEMBL_699953 (CHEMBL1646360)
Ki 398±n/a nM
Citation Zhang, CWestaway, SMSpeake, JDBishop, MJGoetz, ASCarballo, LHHu, MEpperly, AH Tetrahydroquinoline derivatives as opioid receptor antagonists. Bioorg Med Chem Lett21:670-6 (2011) 
 
Delta-type opioid receptor
Name:Delta-type opioid receptor
Type:G Protein-Coupled Receptor (GPCR)
Mol. Mass.:40382.98
Organism:Homo sapiens (Human)
Description:Competition binding assays were carried out using membrane preparations from transfected HN9.10 cells that constitutively expressed the delta opioid receptor.
Residue:372
BDBM50417586
NameBDBM50417586
Synonyms:CHEMBL1642744
TypeSmall organic molecule
Emp. Form.C24H24FN3O
Mol. Mass.389.4653
SMILESNC(=O)c1ccc2N(CCCc2c1)c1ccc(CNCc2cccc(F)c2)cc1