Reaction Details
TargetDelta-type opioid receptor
LigandBDBM50417602
Substrate/Competitorn/a
Meas. Tech.ChEMBL_699953 (CHEMBL1646360)
Ki<3981±n/a nM
Citation Zhang, CWestaway, SMSpeake, JDBishop, MJGoetz, ASCarballo, LHHu, MEpperly, AH Tetrahydroquinoline derivatives as opioid receptor antagonists. Bioorg Med Chem Lett21:670-6 (2011) 
 
Delta-type opioid receptor
Name:Delta-type opioid receptor
Type:G Protein-Coupled Receptor (GPCR)
Mol. Mass.:40382.98
Organism:Homo sapiens (Human)
Description:Competition binding assays were carried out using membrane preparations from transfected HN9.10 cells that constitutively expressed the delta opioid receptor.
Residue:372
BDBM50417602
NameBDBM50417602
Synonyms:CHEMBL1642761
TypeSmall organic molecule
Emp. Form.C24H30N2
Mol. Mass.346.5084
SMILESC(CC1=CCCCC1)NCc1ccc(cc1)N1CCCc2ccccc12