Reaction Details
TargetMu-type opioid receptor
LigandBDBM50417580
Substrate/Competitorn/a
Meas. Tech.ChEMBL_699952 (CHEMBL1646359)
Ki 631±n/a nM
Citation Zhang, CWestaway, SMSpeake, JDBishop, MJGoetz, ASCarballo, LHHu, MEpperly, AH Tetrahydroquinoline derivatives as opioid receptor antagonists. Bioorg Med Chem Lett21:670-6 (2011) 
 
Mu-type opioid receptor
Name:Mu-type opioid receptor
Type:G Protein-Coupled Receptor (GPCR)
Mol. Mass.:44789.51
Organism:Homo sapiens (Human)
Description:P35372
Residue:400
BDBM50417580
NameBDBM50417580
Synonyms:CHEMBL1642738
TypeSmall organic molecule
Emp. Form.C21H27N3O
Mol. Mass.337.4586
SMILESCC(C)CNCc1ccc(cc1)N1CCCc2cc(ccc12)C(N)=O