Reaction Details
TargetMu-type opioid receptor
LigandBDBM50417590
Substrate/Competitorn/a
Meas. Tech.ChEMBL_699952 (CHEMBL1646359)
Ki 13±n/a nM
Citation Zhang, CWestaway, SMSpeake, JDBishop, MJGoetz, ASCarballo, LHHu, MEpperly, AH Tetrahydroquinoline derivatives as opioid receptor antagonists. Bioorg Med Chem Lett21:670-6 (2011) 
 
Mu-type opioid receptor
Name:Mu-type opioid receptor
Type:G Protein-Coupled Receptor (GPCR)
Mol. Mass.:44789.51
Organism:Homo sapiens (Human)
Description:P35372
Residue:400
BDBM50417590
NameBDBM50417590
Synonyms:CHEMBL1642748
TypeSmall organic molecule
Emp. Form.C26H26FN3O
Mol. Mass.415.5025
SMILESNC(=O)c1ccc2N(CCCc2c1)c1ccc(CNC2Cc3ccc(F)cc3C2)cc1