Reaction Details
TargetKappa-type opioid receptor
LigandBDBM50417585
Substrate/Competitorn/a
Meas. Tech.ChEMBL_699954 (CHEMBL1646361)
Ki 631±n/a nM
Citation Zhang, CWestaway, SMSpeake, JDBishop, MJGoetz, ASCarballo, LHHu, MEpperly, AH Tetrahydroquinoline derivatives as opioid receptor antagonists. Bioorg Med Chem Lett21:670-6 (2011) 
 
Kappa-type opioid receptor
Name:Kappa-type opioid receptor
Type:G Protein-Coupled Receptor (GPCR)
Mol. Mass.:42648.76
Organism:Homo sapiens (Human)
Description:P41145
Residue:380
BDBM50417585
NameBDBM50417585
Synonyms:CHEMBL1642743
TypeSmall organic molecule
Emp. Form.C23H25N3OS
Mol. Mass.391.529
SMILESNC(=O)c1ccc2N(CCCc2c1)c1ccc(CNCCc2cccs2)cc1