Reaction Details
TargetKappa-type opioid receptor
LigandBDBM50417601
Substrate/Competitorn/a
Meas. Tech.ChEMBL_699954 (CHEMBL1646361)
Ki 631±n/a nM
Citation Zhang, CWestaway, SMSpeake, JDBishop, MJGoetz, ASCarballo, LHHu, MEpperly, AH Tetrahydroquinoline derivatives as opioid receptor antagonists. Bioorg Med Chem Lett21:670-6 (2011) 
 
Kappa-type opioid receptor
Name:Kappa-type opioid receptor
Type:G Protein-Coupled Receptor (GPCR)
Mol. Mass.:42648.76
Organism:Homo sapiens (Human)
Description:P41145
Residue:380
BDBM50417601
NameBDBM50417601
Synonyms:CHEMBL1642760
TypeSmall organic molecule
Emp. Form.C26H33N3O
Mol. Mass.403.5597
SMILESCc1cc(ccc1CNCCC1=CCCCC1)N1CCCc2cc(ccc12)C(N)=O