Reaction Details
TargetKappa-type opioid receptor
LigandBDBM50417586
Substrate/Competitorn/a
Meas. Tech.ChEMBL_699954 (CHEMBL1646361)
Ki 631±n/a nM
Citation Zhang, CWestaway, SMSpeake, JDBishop, MJGoetz, ASCarballo, LHHu, MEpperly, AH Tetrahydroquinoline derivatives as opioid receptor antagonists. Bioorg Med Chem Lett21:670-6 (2011) 
 
Kappa-type opioid receptor
Name:Kappa-type opioid receptor
Type:G Protein-Coupled Receptor (GPCR)
Mol. Mass.:42648.76
Organism:Homo sapiens (Human)
Description:P41145
Residue:380
BDBM50417586
NameBDBM50417586
Synonyms:CHEMBL1642744
TypeSmall organic molecule
Emp. Form.C24H24FN3O
Mol. Mass.389.4653
SMILESNC(=O)c1ccc2N(CCCc2c1)c1ccc(CNCc2cccc(F)c2)cc1