Reaction Details
TargetKappa-type opioid receptor
LigandBDBM50417603
Substrate/Competitorn/a
Meas. Tech.ChEMBL_699954 (CHEMBL1646361)
Ki<3981±n/a nM
Citation Zhang, CWestaway, SMSpeake, JDBishop, MJGoetz, ASCarballo, LHHu, MEpperly, AH Tetrahydroquinoline derivatives as opioid receptor antagonists. Bioorg Med Chem Lett21:670-6 (2011) 
 
Kappa-type opioid receptor
Name:Kappa-type opioid receptor
Type:G Protein-Coupled Receptor (GPCR)
Mol. Mass.:42648.76
Organism:Homo sapiens (Human)
Description:P41145
Residue:380
BDBM50417603
NameBDBM50417603
Synonyms:CHEMBL1642762
TypeSmall organic molecule
Emp. Form.C25H30N2O2
Mol. Mass.390.5179
SMILESOC(=O)c1ccc2N(CCCc2c1)c1ccc(CNCCC2=CCCCC2)cc1