Reaction Details
TargetAdenosine receptor A3
LigandBDBM50051234
Substrate/Competitorn/a
Meas. Tech.ChEMBL_701308 (CHEMBL1648928)
Ki 281838.29±n/a nM
Citation Pran Kishore, DBalakumar, CRaghuram Rao, ARoy, PPRoy, K QSAR of adenosine receptor antagonists: Exploring physicochemical requirements for binding of pyrazolo[4,3-e]-1,2,4-triazolo[1,5-c]pyrimidine derivatives with human adenosine A(3) receptor subtype. Bioorg Med Chem Lett21:818-23 (2011) 
 
Adenosine receptor A3
Name:Adenosine receptor A3
Type:G Protein-Coupled Receptor (GPCR)
Mol. Mass.:36197.32
Organism:Homo sapiens (Human)
Description:P0DMS8
Residue:318
BDBM50051234
NameBDBM50051234
Synonyms:2-(furan-2-yl)-8-phenethyl-8H-pyrazolo[4,3-e][1,2,4]triazolo[1,5-c]pyrimidin-5-amine CHEMBL16867 | N-[2-Furan-2-yl-8-(3-phenyl-propyl)-2,8-dihydro-3H-pyrazolo[4,3-e][1,2,4]triazolo[1,5-c]pyrimidin-5-yl]-2-phenoxy-acetamide
TypeSmall organic molecule
Emp. Form.C18H15N7O
Mol. Mass.345.358
SMILESNc1nc2nn(CCc3ccccc3)cc2c2nc(nn12)-c1ccco1