Reaction Details
TargetAcetylcholinesterase
LigandBDBM50039729
Substrate/Competitorn/a
Meas. Tech.ChEMBL_715113 (CHEMBL1664219)
IC50 5.75±n/a nM
Citation Araújo, JQde Brito, MAHoelz, LVde Alencastro, RBCastro, HCRodrigues, CRAlbuquerque, MG Receptor-dependent (RD) 3D-QSAR approach of a series of benzylpiperidine inhibitors of human acetylcholinesterase (HuAChE). Eur J Med Chem46:39-51 (2010) 
 
Acetylcholinesterase
Name:Acetylcholinesterase
Type:Enzyme
Mol. Mass.:67792.70
Organism:Homo sapiens (Human)
Description:P22303
Residue:614
BDBM50039729
NameBDBM50039729
Synonyms:3-(2-(1-benzylpiperidin-4-yl)ethyl)-5,6-dimethylbenzo[d]isoxazole CHEMBL91291
TypeSmall organic molecule
Emp. Form.C23H28N2O
Mol. Mass.348.4812
SMILESCc1cc2onc(CCC3CCN(Cc4ccccc4)CC3)c2cc1C