Reaction Details
Target5-hydroxytryptamine receptor 6
LigandBDBM50417915
Substrate/Competitorn/a
Meas. Tech.ChEMBL_716899 (CHEMBL1670878)
Ki 0.24±n/a nM
Citation Ivachtchenko, AVGolovina, ESKadieva, MGKysil, VMMitkin, ODTkachenko, SEOkun, I Synthesis and SAR of 3-arylsulfonyl-pyrazolo[1,5-a]pyrimidines as potent serotonin 5-HT6 receptor antagonists. Bioorg Med Chem19:1482-91 (2011) 
 
5-hydroxytryptamine receptor 6
Name:5-hydroxytryptamine receptor 6
Type:G Protein-Coupled Receptor (GPCR)
Mol. Mass.:46968.43
Organism:Homo sapiens (Human)
Description:P50406
Residue:440
BDBM50417915
NameBDBM50417915
Synonyms:CHEMBL1668586 | US8618114, 1.2.3(1)
TypeSmall organic molecule
Emp. Form.C14H14N4O2S
Mol. Mass.302.352
SMILESCNc1nn2c(C)ccnc2c1S(=O)(=O)c1ccccc1