Reaction Details
TargetPotassium voltage-gated channel subfamily H member 2
LigandBDBM24226
Substrate/Competitorn/a
Meas. Tech.ChEMBL_725152 (CHEMBL1676103)
IC50 11.48±n/a nM
Citation Sinha, NSen, S Predicting hERG activities of compounds from their 3D structures: development and evaluation of a global descriptors based QSAR model. Eur J Med Chem46:618-30 (2011) 
 
Potassium voltage-gated channel subfamily H member 2
Name:Potassium voltage-gated channel subfamily H member 2
Type:Multi-pass membrane protein
Mol. Mass.:126672.65
Organism:Homo sapiens (Human)
Description:Q12809
Residue:1159
BDBM24226
NameBDBM24226
Synonyms:1-[(4-fluorophenyl)methyl]-N-{1-[2-(4-methoxyphenyl)ethyl]piperidin-4-yl}-1H-1,3-benzodiazol-2-amine Astemizole, [O-Methyl-3H] Hismanal [3H]-ASTEMIZOLE cid_2247 | med.21724, Compound Astemizole
TypeRadiolabeled ligand
Emp. Form.C28H31FN4O
Mol. Mass.458.5703
SMILESCOc1ccc(CCN2CCC(CC2)Nc2nc3ccccc3n2Cc2ccc(F)cc2)cc1