Reaction Details
TargetPotassium voltage-gated channel subfamily H member 2
LigandBDBM50083351
Substrate/Competitorn/a
Meas. Tech.ChEMBL_725152 (CHEMBL1676103)
IC50 100±n/a nM
Citation Sinha, NSen, S Predicting hERG activities of compounds from their 3D structures: development and evaluation of a global descriptors based QSAR model. Eur J Med Chem46:618-30 (2011) 
 
Potassium voltage-gated channel subfamily H member 2
Name:Potassium voltage-gated channel subfamily H member 2
Type:Multi-pass membrane protein
Mol. Mass.:126672.65
Organism:Homo sapiens (Human)
Description:Q12809
Residue:1159
BDBM50083351
NameBDBM50083351
Synonyms:(+/-)-[2-(4-benzylpiperidino)-1-(4-hydroxyphenyl)-1-propanol] 4-(2-(4-benzylpiperidin-1-yl)-1-hydroxypropyl)phenol CHEMBL305187 IFENPRODIL
TypeSmall organic molecule
Emp. Form.C21H27NO2
Mol. Mass.325.4446
SMILESCC(C(O)c1ccc(O)cc1)N1CCC(Cc2ccccc2)CC1