Reaction Details
TargetIntegrin alpha-4/beta-1
LigandBDBM50338182
Substrate/Competitorn/a
Meas. Tech.ChEMBL_727812 (CHEMBL1686295)
IC50 5.0±n/a nM
Citation Semko, CMChen, LDressen, DBDreyer, MLDunn, WFarouz, FSFreedman, SBHolsztynska, EJJefferies, MKonradi, AWLiao, ALugar, JMutter, LPleiss, MAQuinn, KPThompson, TThorsett, EDVandevert, CXu, YZYednock, TA Discovery of a potent, orally bioavailable pyrimidine VLA-4 antagonist effective in a sheep asthma model. Bioorg Med Chem Lett21:1741-3 (2011) 
 
Integrin alpha-4/beta-1
Name:Integrin alpha-4/beta-1
Type:n/a
Mol. Mass.:n/a
Description:ASSAY_ID of EBI is 88912
Components:This complex has 2 components.
Component 1
Name:Integrin beta-1
Synonyms:CD_antigen=CD29 Fibronectin receptor beta GPIIA ITGB1 MDF2 | MSK12
Type:Enzyme
Mol. Mass.:88400.38
Organism:Homo sapiens (Human)
Description:P05556
Residue:798
Component 2
Name:Integrin alpha-4
Synonyms:CD49 antigen-like family member D CD49d antigen ITA4_HUMAN Integrin alpha-4 Integrin alpha-IV VLA-4 integrin alpha 4 precursor | integrin alpha-4 precursor
Type:Membrane Protein
Mol. Mass.:114897.35
Organism:Homo sapiens (Human)
Description:P13612
Residue:1032
BDBM50338182
NameBDBM50338182
Synonyms:(2S)-3-(4-(dimethylcarbamoyloxy)phenyl)-2-(5-(3-methylthiophen-2-yl)pyrimidin-4-ylamino)propanoic acid | CHEMBL1684968
TypeSmall organic molecule
Emp. Form.C21H22N4O4S
Mol. Mass.426.489
SMILESCN(C)C(=O)Oc1ccc(C[C@H](Nc2ncncc2-c2sccc2C)C(O)=O)cc1