Reaction Details
TargetCytochrome P450 2B4
LigandBDBM50027780
Substrate/Competitorn/a
Meas. Tech.ChEMBL_774153 (CHEMBL1908248)
Ki 37000±n/a nM
Citation Fontana, EDansette, PMPoli, SM Cytochrome p450 enzymes mechanism based inhibitors: common sub-structures and reactivity. Curr Drug Metab6:413-54 (2005) Cytochrome P450 2B4
Name:Cytochrome P450 2B4
Type:PROTEIN
Mol. Mass.:55725.83
Organism:Oryctolagus cuniculus
Description:ChEMBL_774153
Residue:491
BDBM50027780
NameBDBM50027780
Synonyms:CHEMBL1908229
TypeSmall organic molecule
Emp. Form.C8H14O
Mol. Mass.126.1962
SMILESCC(OC(C)(C)C)C#C