Reaction Details
TargetCytochrome P450 3A4
LigandBDBM578
Substrate/Competitorn/a
Meas. Tech.ChEMBL_738395 (CHEMBL1743472)
Ki 410±n/a nM
Citation Fontana, EDansette, PMPoli, SM Cytochrome p450 enzymes mechanism based inhibitors: common sub-structures and reactivity. Curr Drug Metab6:413-54 (2005) Cytochrome P450 3A4
Name:Cytochrome P450 3A4
Type:Enzyme
Mol. Mass.:57349.57
Organism:Homo sapiens (Human)
Description:n/a
Residue:503
BDBM578
NameBDBM578
Synonyms:(2S)-N-[(2S,4S,5S)-5-[2-(2,6-dimethylphenoxy)acetamido]-4-hydroxy-1,6-diphenylhexan-2-yl]-3-methyl-2-(2-oxo-1,3-diazinan-1-yl)butanamide Aluviran LPV | Lopinavir
TypeSmall organic molecule
Emp. Form.C37H48N4O5
Mol. Mass.628.8008
SMILESCC(C)[C@H](N1CCCNC1=O)C(=O)N[C@H](C[C@H](O)[C@H](Cc1ccccc1)NC(=O)COc1c(C)cccc1C)Cc1ccccc1