Reaction Details
TargetCytochrome P450 2A6
LigandBDBM50418084
Substrate/Competitorn/a
Meas. Tech.ChEMBL_738461 (CHEMBL1743538)
Ki 840±n/a nM
Citation Fontana, EDansette, PMPoli, SM Cytochrome p450 enzymes mechanism based inhibitors: common sub-structures and reactivity. Curr Drug Metab6:413-54 (2005) Cytochrome P450 2A6
Name:Cytochrome P450 2A6
Type:Protein
Mol. Mass.:56514.34
Organism:Homo sapiens (Human)
Description:P11509
Residue:494
BDBM50418084
NameBDBM50418084
Synonyms:MENTHOFURAN
TypeSmall organic molecule
Emp. Form.C10H14O
Mol. Mass.150.2176
SMILESCC1CCc2c(C)coc2C1