Reaction Details
TargetCytochrome P450 2B6
LigandBDBM50418086
Substrate/Competitorn/a
Meas. Tech.ChEMBL_738481 (CHEMBL1743382)
Ki 3800±n/a nM
Citation Fontana, EDansette, PMPoli, SM Cytochrome p450 enzymes mechanism based inhibitors: common sub-structures and reactivity. Curr Drug Metab6:413-54 (2005) Cytochrome P450 2B6
Name:Cytochrome P450 2B6
Type:Protein
Mol. Mass.:56289.75
Organism:Homo sapiens (Human)
Description:P20813
Residue:491
BDBM50418086
NameBDBM50418086
Synonyms:THIOTEPA | Thioplex
TypeSmall organic molecule
Emp. Form.C6H12N3PS
Mol. Mass.189.218
SMILESS=P(N1CC1)(N1CC1)N1CC1