Reaction Details
TargetCytochrome P450 2B4
LigandBDBM50027798
Substrate/Competitorn/a
Meas. Tech.ChEMBL_774153 (CHEMBL1908248)
Ki 75000±n/a nM
Citation Fontana, EDansette, PMPoli, SM Cytochrome p450 enzymes mechanism based inhibitors: common sub-structures and reactivity. Curr Drug Metab6:413-54 (2005) Cytochrome P450 2B4
Name:Cytochrome P450 2B4
Type:PROTEIN
Mol. Mass.:55725.83
Organism:Oryctolagus cuniculus
Description:ChEMBL_774153
Residue:491
BDBM50027798
NameBDBM50027798
Synonyms:CHEMBL1908221
TypeSmall organic molecule
Emp. Form.C6H10
Mol. Mass.82.1436
SMILESCC(C)(C)C#C