Reaction Details
TargetCytochrome P450 2B6
LigandBDBM50397662
Substrate/Competitorn/a
Meas. Tech.ChEMBL_738484 (CHEMBL1743385)
Ki 1100±n/a nM
Citation Fontana, EDansette, PMPoli, SM Cytochrome p450 enzymes mechanism based inhibitors: common sub-structures and reactivity. Curr Drug Metab6:413-54 (2005) Cytochrome P450 2B6
Name:Cytochrome P450 2B6
Type:Protein
Mol. Mass.:56289.75
Organism:Homo sapiens (Human)
Description:P20813
Residue:491
BDBM50397662
NameBDBM50397662
Synonyms:CLOPIDOGREL
TypeSmall organic molecule
Emp. Form.C16H16ClNO2S
Mol. Mass.321.822
SMILESCOC(=O)[C@@H](N1CCc2sccc2C1)c1ccccc1Cl