Reaction Details
TargetCytochrome P450 1A2
LigandBDBM50236897
Substrate/Competitorn/a
Meas. Tech.ChEMBL_738455 (CHEMBL1743532)
Ki 23000±n/a nM
Citation Fontana, EDansette, PMPoli, SM Cytochrome p450 enzymes mechanism based inhibitors: common sub-structures and reactivity. Curr Drug Metab6:413-54 (2005) Cytochrome P450 1A2
Name:Cytochrome P450 1A2
Type:Enzyme
Mol. Mass.:58423.38
Organism:Homo sapiens (Human)
Description:P05177
Residue:516
BDBM50236897
NameBDBM50236897
Synonyms:3-(furan-2-ylmethyl)-1,8-dimethyl-1H-purine-2,6(3H,7H)-dione US9180183, Furafylline | furafylline
TypeSmall organic molecule
Emp. Form.C12H12N4O3
Mol. Mass.260.2487
SMILESCc1nc2n(Cc3ccco3)c(=O)n(C)c(=O)c2[nH]1