Reaction Details
TargetCytochrome P450 2D6
LigandBDBM48320
Substrate/Competitorn/a
Meas. Tech.ChEMBL_738336 (CHEMBL1743413)
Ki 960±n/a nM
Citation Fontana, EDansette, PMPoli, SM Cytochrome p450 enzymes mechanism based inhibitors: common sub-structures and reactivity. Curr Drug Metab6:413-54 (2005) Cytochrome P450 2D6
Name:Cytochrome P450 2D6
Type:Protein
Mol. Mass.:55774.82
Organism:Homo sapiens (Human)
Description:P10635
Residue:497
BDBM48320
NameBDBM48320
Synonyms:4-amino-5-chloro-N-[2-(diethylamino)ethyl]-2-methoxy-benzamide;hydrochloride 4-azanyl-5-chloranyl-N-[2-(diethylamino)ethyl]-2-methoxy-benzamide;hydrochloride METOCLOPRAMIDE HYDROCHLORIDE Metochloropramide US11147820, Compound Metoclopramide US9132134, Metoclopramide | cid_23659
TypeSmall organic molecule
Emp. Form.C14H22ClN3O2
Mol. Mass.299.796
SMILESCCN(CC)CCNC(=O)c1cc(Cl)c(N)cc1OC