Reaction Details
TargetCytochrome P450 2C8
LigandBDBM50336507
Substrate/Competitorn/a
Meas. Tech.ChEMBL_738491 (CHEMBL1743392)
Ki 170000±n/a nM
Citation Fontana, EDansette, PMPoli, SM Cytochrome p450 enzymes mechanism based inhibitors: common sub-structures and reactivity. Curr Drug Metab6:413-54 (2005) Cytochrome P450 2C8
Name:Cytochrome P450 2C8
Type:Protein
Mol. Mass.:55839.23
Organism:Homo sapiens (Human)
Description:P10632
Residue:490
BDBM50336507
NameBDBM50336507
Synonyms:4-pyridinecarbohydrazide(Isoniazid) Dow-isoniazid INH Isoniazid (INH) Isonicotinic acid hydrazide(Isoniazid) Laniazid Rimifon isoniazid isonicotinhydrazide isonicotinyl hydrazide | pyridine-4-carbohydrazide
TypeSmall organic molecule
Emp. Form.C6H7N3O
Mol. Mass.137.1393
SMILESNNC(=O)c1ccncc1