Reaction Details
TargetCytochrome P450 2C9
LigandBDBM50090676
Substrate/Competitorn/a
Meas. Tech.ChEMBL_738494 (CHEMBL1743395)
Ki 3700±n/a nM
Citation Fontana, EDansette, PMPoli, SM Cytochrome p450 enzymes mechanism based inhibitors: common sub-structures and reactivity. Curr Drug Metab6:413-54 (2005) Cytochrome P450 2C9
Name:Cytochrome P450 2C9
Type:Enzyme
Mol. Mass.:55636.33
Organism:Homo sapiens (Human)
Description:P11712
Residue:490
BDBM50090676
NameBDBM50090676
Synonyms:(+-)-2-(p-(2-thenoyl)phenyl)propionic acid 2-[4-(thiophen-2-ylcarbonyl)phenyl]propanoic acid CHEMBL956 alpha-methyl-4-(2-thienylcarbonyl)benzeneacetic acid | p-2-thenoylhydratropic acid
TypeSmall organic molecule
Emp. Form.C14H12O3S
Mol. Mass.260.308
SMILESCC(C(O)=O)c1ccc(cc1)C(=O)c1cccs1