Reaction Details
TargetCytochrome P450 2B1
LigandBDBM50187243
Substrate/Competitorn/a
Meas. Tech.ChEMBL_738415 (CHEMBL1743492)
Ki 11000±n/a nM
Citation Fontana, EDansette, PMPoli, SM Cytochrome p450 enzymes mechanism based inhibitors: common sub-structures and reactivity. Curr Drug Metab6:413-54 (2005) Cytochrome P450 2B1
Name:Cytochrome P450 2B1
Type:PROTEIN
Mol. Mass.:55940.51
Organism:Rattus norvegicus
Description:ChEMBL_774167
Residue:491
BDBM50187243
NameBDBM50187243
Synonyms:17-ethinyl-3,17-estradiol 17-ethinylestradiol 17alpha-ethynylestra-1,3,5(10)-triene-3,17beta-diol CHEMBL691 Ethinylestradiol ethinyloestradiol
TypeSmall organic molecule
Emp. Form.C20H24O2
Mol. Mass.296.4034
SMILESC[C@]12CC[C@H]3[C@@H](CCc4cc(O)ccc34)[C@@H]1CC[C@@]2(O)C#C