Reaction Details
TargetGABA-A receptor; alpha-2/beta-3/gamma-2
LigandBDBM50418458
Substrate/Competitorn/a
Meas. Tech.ChEMBL_751257 (CHEMBL1787625)
Ki 29.51±n/a nM
Citation Alhambra, CBecker, CBlake, TChang, AHDamewood, JRDaniels, TDembofsky, BTGurley, DAHall, JEHerzog, KJHorchler, CLOhnmacht, CJSchmiesing, RJDudley, ARibadeneira, MDKnappenberger, KSMaciag, CStein, MMChopra, MLiu, XFChristian, EPArriza, JLChapdelaine, MJ Development and SAR of functionally selective allosteric modulators of GABAA receptors. Bioorg Med Chem19:2927-38 (2011) 
 
GABA-A receptor; alpha-2/beta-3/gamma-2
Name:GABA-A receptor; alpha-2/beta-3/gamma-2
Type:n/a
Mol. Mass.:n/a
Description:ASSAY_ID of ChEMBL is 2148174
Components:This complex has 3 components.
Component 1
Name:Gamma-aminobutyric acid receptor subunit gamma-2
Synonyms:GABA(A) receptor subunit gamma-2 GBRG2_HUMAN
Type:PROTEIN
Mol. Mass.:54172.74
Organism:Homo sapiens (Human)
Description:EBI_217
Residue:467
Component 2
Name:Gamma-aminobutyric acid receptor subunit beta-3
Synonyms:GABA A receptor alpha-4/beta-3/gamma-2 GABA-A receptor GBRB3_HUMAN | agonist GABA site
Type:PROTEIN
Mol. Mass.:54130.51
Organism:Homo sapiens (Human)
Description:ChEMBL_448071
Residue:473
Component 3
Name:Gamma-aminobutyric acid receptor subunit alpha-2
Synonyms:GABA receptor alpha-2 subunit GBRA2_HUMAN | Gamma-aminobutyric acid receptor subunit alpha-2 (GABRA2)
Type:Protein
Mol. Mass.:51338.78
Organism:Homo sapiens (Human)
Description:P47869
Residue:451
BDBM50418458
NameBDBM50418458
Synonyms:CHEMBL1783258
TypeSmall organic molecule
Emp. Form.C19H20N4O3
Mol. Mass.352.3871
SMILESCCNC(=O)c1nnc2c(cccc2c1N)-c1cc(OC)ccc1OC