Reaction Details
TargetCytochrome P450 2C9
LigandBDBM50418552
Substrate/Competitorn/a
Meas. Tech.ChEMBL_752251 (CHEMBL1785940)
EC50 25118.86±n/a nM
Citation Wendt, BMulbaier, MWawro, SSchultes, CAlonso, JJanssen, BLewis, J Toluidinesulfonamide hypoxia-induced factor 1 inhibitors: alleviating drug-drug interactions through use of PubChem data and comparative molecular field analysis guided synthesis. J Med Chem54:3982-6 (2011) 
 
Cytochrome P450 2C9
Name:Cytochrome P450 2C9
Type:Enzyme
Mol. Mass.:55636.33
Organism:Homo sapiens (Human)
Description:P11712
Residue:490
BDBM50418552
NameBDBM50418552
Synonyms:CHEMBL1784700
TypeSmall organic molecule
Emp. Form.C17H19NO5S
Mol. Mass.349.401
SMILESCOC(=O)c1ccc(C)c(c1)N(C)S(=O)(=O)c1ccc(OC)cc1