Reaction Details
TargetCytochrome P450 2C9
LigandBDBM50418554
Substrate/Competitorn/a
Meas. Tech.ChEMBL_752251 (CHEMBL1785940)
EC50 1584.89±n/a nM
Citation Wendt, BMulbaier, MWawro, SSchultes, CAlonso, JJanssen, BLewis, J Toluidinesulfonamide hypoxia-induced factor 1 inhibitors: alleviating drug-drug interactions through use of PubChem data and comparative molecular field analysis guided synthesis. J Med Chem54:3982-6 (2011) 
 
Cytochrome P450 2C9
Name:Cytochrome P450 2C9
Type:Enzyme
Mol. Mass.:55636.33
Organism:Homo sapiens (Human)
Description:P11712
Residue:490
BDBM50418554
NameBDBM50418554
Synonyms:CHEMBL1784702
TypeSmall organic molecule
Emp. Form.C16H17NO4S
Mol. Mass.319.375
SMILESCOC(=O)c1ccc(C)c(NS(=O)(=O)c2ccc(C)cc2)c1