Reaction Details
TargetBeta-1 adrenergic receptor
LigandBDBM50418937
Substrate/Competitorn/a
Meas. Tech.ChEMBL_759387 (CHEMBL1810625)
IC50 79±n/a nM
Citation Connolly, SAlcaraz, LBailey, ACadogan, EChristie, JCook, ARFisher, AJHill, SHumphries, AIngall, AHKane, ZPaine, SPairaudeau, GStocks, MJYoung, A Design-driven LO: the discovery of new ultra long acting dibasicß2-adrenoceptor agonists. Bioorg Med Chem Lett21:4612-6 (2011) 
 
Beta-1 adrenergic receptor
Name:Beta-1 adrenergic receptor
Type:G Protein-Coupled Receptor (GPCR)
Mol. Mass.:51338.40
Organism:Homo sapiens (Human)
Description:P08588
Residue:477
BDBM50418937
NameBDBM50418937
Synonyms:CHEMBL1807871
TypeSmall organic molecule
Emp. Form.C22H27Cl2N3O3S2
Mol. Mass.516.504
SMILESO[C@@H](CNCCCSCCNCCc1cccc(Cl)c1Cl)c1ccc(O)c2[nH]c(=O)sc12