Reaction Details
TargetBeta-2 adrenergic receptor
LigandBDBM50418955
Substrate/Competitorn/a
Meas. Tech.ChEMBL_759384 (CHEMBL1810622)
EC50 0.630957±n/a nM
Citation Connolly, SAlcaraz, LBailey, ACadogan, EChristie, JCook, ARFisher, AJHill, SHumphries, AIngall, AHKane, ZPaine, SPairaudeau, GStocks, MJYoung, A Design-driven LO: the discovery of new ultra long acting dibasicß2-adrenoceptor agonists. Bioorg Med Chem Lett21:4612-6 (2011) 
 
Beta-2 adrenergic receptor
Name:Beta-2 adrenergic receptor
Type:n/a
Mol. Mass.:46461.69
Organism:Homo sapiens (Human)
Description:P07550
Residue:413
BDBM50418955
NameBDBM50418955
Synonyms:CHEMBL1807831
TypeSmall organic molecule
Emp. Form.C22H28ClN3O5S2
Mol. Mass.514.058
SMILESO[C@@H](CNCCS(=O)(=O)CCCNCCc1cccc(Cl)c1)c1ccc(O)c2[nH]c(=O)sc12