Reaction Details
TargetBeta-1 adrenergic receptor
LigandBDBM86453
Substrate/Competitorn/a
Meas. Tech.ChEMBL_759387 (CHEMBL1810625)
IC50<631±n/a nM
Citation Connolly, SAlcaraz, LBailey, ACadogan, EChristie, JCook, ARFisher, AJHill, SHumphries, AIngall, AHKane, ZPaine, SPairaudeau, GStocks, MJYoung, A Design-driven LO: the discovery of new ultra long acting dibasicß2-adrenoceptor agonists. Bioorg Med Chem Lett21:4612-6 (2011) 
 
Beta-1 adrenergic receptor
Name:Beta-1 adrenergic receptor
Type:G Protein-Coupled Receptor (GPCR)
Mol. Mass.:51338.40
Organism:Homo sapiens (Human)
Description:P08588
Residue:477
BDBM86453
NameBDBM86453
Synonyms:CAS_73573-87-2 NSC_3083544
TypeSmall organic molecule
Emp. Form.C19H24N2O4
Mol. Mass.344.4049
SMILESCOc1ccc(CC(C)NCC(O)c2ccc(O)c(NC=O)c2)cc1